HUMANITIES-THESAURUS
type: ConceptScheme

Μάχες
contributor: Κατσιαδάκη Ελένη (ΑΑ)
contributor: Katsiadakis Helen (AA) @en
scope note: Ένοπλες χερσαίες συγκρούσεις μεταξύ αντιμαχόμενων δυνάμεων στη διάρκεια μιας ευρύτερης στρατιωτικής-πολιτικής αντιπαράθεσης, οι οποίες εντάσσονται στο πλαίσιο στρατηγικών σχεδιασμών για την επίτευξη ενός τελικού στόχου. Οι μάχες ποικίλλουν κατά τη διάρκειά, την ένταση, το μέγεθος των εμπλεκόμενων δυνάμεων, τις απώλειες, τα πολεμικά μέσα, την τακτική και τη μορφή της σύγκρουσης. Ωστόσο θεωρείται αναλυτικά σκόπιμο να αντιμετωπίζονται όλες ως μια ενιαία κατηγορία με τις κατά περίπτωση εσωτερικές της διαφοροποιήσεις.
scope note: Armed conflicts between opponent forces during a wider politico-military confrontation, which are included in strategic plans for the achievement of a final goal. Battles vary according to their duration, intensity, size of participant forces, casualties, military means, tactics and forms of conflict. However, it is analytically advisable to consider them all as a single category with its relevant internal differentiations. @en
type: Concept
creator: Tzedopoulos Giorgos (AA) @de
creator: Τζεδόπουλος Γιώργος (ΑΑ)
created: 2019-07-16
modified: 2020-04-02
preferred label: Battles @en
broader: Πολεμικά γεγονότα
status: Εκδοθείς
in scheme: HUMANITIES-THESAURUS
notation: 1853
source: Jaques 2007

Πολεμικά γεγονότα
notation: 1852
preferred label: War events @en
type: Concept
narrower: Μάχες