HUMANITIES-THESAURUS
type: ConceptScheme

Ιστορικές επαγγελματικές ομάδες
notation: 2636
preferred label: Historical occupational groups @en
type: Concept
narrower: Παραμάνες

Παραμάνες
alternative label: Nannies @en
alternative label: Τροφοί
alternative label: Νταντάδες
scope note: Γυναίκες που θήλαζαν ένα ξένο βρέφος έναντι αμοιβής ή/και αναλάμβαναν την ανατροφή του.
scope note: Women who nursed/ breast-fed another woman’s infant for a fee and / or undertook its upbringing. @en
contributor: Φαλιέρου Αναστασία (ΑΑ)
contributor: Falierou Anastasia (AA) @fr
preferred label: Wet nurses @en
creator: Falierou Anastasia (AA) @la
creator: Φαλιέρου Αναστασία (ΑΑ)
status: Εκδοθείς
broader: Ιστορικές επαγγελματικές ομάδες
in scheme: HUMANITIES-THESAURUS
created: 2019-07-08
notation: 1813
type: Concept
source: Χαραλαμπάκης 2014
modified: 2020-10-20