Εύθυναι
notation: 1809
preferred label: Euthynai @en
type: Concept
related: Εύθυνοι

HUMANITIES-THESAURUS
type: ConceptScheme

Ειδικές επιτροπές (Αρχαία Ελλάδα)
notation: 1742
preferred label: Special committees (Ancient Greece) @en
type: Concept
narrower: Εύθυνοι

Εύθυνοι
creator: Χρυσοβιτσάνος Γεράσιμος (ΑΑ)
creator: Chrysovitsanos Gerasimos (AA) @fr
scope note: Committees of officials selected by lot, who were responsible for the final audit of the financial reports provided by the various committees at the end of their term of office. @en
scope note: Επιτροπές δέκα αξιωματούχων οι οποίοι είχαν την ευθύνη για τον τελικό έλεγχο των οικονομικών απολογισμών που απέδιδαν οι διάφορες επιτροπές με το πέρας της θητείας τους.
in scheme: HUMANITIES-THESAURUS
status: Εκδοθείς
preferred label: Euthynoi @en
contributor: Katsiadakis Helen (AA) @en
contributor: Κατσιαδάκη Ελένη (ΑΑ)
notation: 1808
modified: 2019-10-27
created: 2019-07-03
broader: Ειδικές επιτροπές (Αρχαία Ελλάδα)
type: Concept
related: Εύθυναι
source: Glotz 1994