Δομικά μέρη πληροφοριακού αντικειμένου
notation: 702
type: Concept
narrower: Παράβαση (θέατρο)

Παράβαση (θέατρο)
preferred label: Parabassis @en
preferred label: Parabase @de
scope note: Μέρος της αττικής κωμωδίας, ανεξάρτητο από την υπόθεση του έργου, κατά τη διάρκεια του οποίου η δραματική εξέλιξη αναστέλλεται, για να γίνει χώρος έκφρασης των απόψεων του ποιητή. Ο Χορός απευθύνεται άμεσα προς το κοινό, αίροντας τη θεατρική ψευδαίσθηση, για να του ανακοινώσει τις απόψεις, τις διακηρύξεις αλλά και τις συμβουλευτικές προτροπές του συγγραφέα, βγαίνοντας προς στιγμήν από τον δραματικό του ρόλο. Συνήθως ακολουθούσε τον αγώνα, ενώ στις πρώιμες μορφές κωμωδίας συχνά βρισκόταν στο τέλος του έργου.
scope note: Element of the attic comedy, irrelevant to the plot of the play, when the dramatic action is suspended, becoming a means of expressing the views of the poet. The Chorus addresses the audience directly breaking the dramatic illusion to announce the views, proclamations, and the advice of the playwright, stepping temporarily aside from its dramatic part. Usually parabassis followed the agon, while at the early stages of attic comedy it used to end the play. @en
type: Concept
contributor: Vernardaki Eleni (AA) @fr
contributor: Βερναρδάκη Ελένη (ΑΑ)
related: Αποστροφή προς το κοινό
related: Αττική κωμωδία
related: Χορός (αρχαίο δράμα)
created: 2019-06-28
creator: Γουλή Ελένη (ΑΑ)
creator: Goulis Helen (AA) @la
source: Sifakis 1971
source: Dover 1981
source: Hubbard 1991
source: Bowie 1982
in scheme: HUMANITIES-THESAURUS
broader: Δομικά μέρη πληροφοριακού αντικειμένου
modified: 2020-10-06
status: Εκδοθείς
notation: 1802

Αττική κωμωδία
notation: 1287
preferred label: Comédie ancienne @fr
preferred label: Ancient comedy @en
preferred label: Antike Komödie @de
type: Concept
related: Παράβαση (θέατρο)

HUMANITIES-THESAURUS
type: ConceptScheme

Χορός (αρχαίο δράμα)
notation: 1806
preferred label: Chorus (Ancient Greek drama) @en
preferred label: Choeur (Théâtre grec antique) @fr
preferred label: Chor (Griechische Drama) @de
type: Concept
related: Παράβαση (θέατρο)

Αποστροφή προς το κοινό
notation: 257
preferred label: Address to the audience @en
preferred label: Addresse au publique @fr
preferred label: Anrede ans Publikum @de
type: Concept
related: Παράβαση (θέατρο)