HUMANITIES-THESAURUS
type: ConceptScheme

Θρησκευτικά αξιώματα
notation: 1583
preferred label: Religious offices @en
type: Concept
narrower: Ιεροποιός (περίοδος πόλης-κράτους)

Ιεροποιοί
notation: 1744
preferred label: Hieropoioi @en
type: Concept
related: Ιεροποιός (περίοδος πόλης-κράτους)

Ιεροποιός (περίοδος πόλης-κράτους)
type: Concept
creator: Χρυσοβιτσάνος Γεράσιμος (ΑΑ)
creator: Chrysovitsanos Gerasimos (AA) @fr
created: 2019-06-28
in scheme: HUMANITIES-THESAURUS
scope note: Τα μέλη της επιτροπής των Ιεροποιών κατείχαν το αξίωμα του Ιεροποιoύ με κύριο καθήκον την επίβλεψη ιερών τελετών και θυσιών είτε σε μεγάλες εορτές είτε σε ιερά και ναούς.
scope note: The members of the sacred commission (Hieropoioi) held the office of the Hieropoios with the primary task of overseeing sacred ceremonies and sacrifices, either on great feasts or in sanctuaries and temples. @en
contributor: Κατσιαδάκη Ελένη (ΑΑ)
contributor: Katsiadakis Helen (AA) @en
status: Εκδοθείς
preferred label: Hieropoios (city-state period) @en
modified: 2019-11-07
related: Ιεροποιοί
notation: 1795
source: Harris 1995
source: Glotz 1994
broader: Θρησκευτικά αξιώματα