Σύνοδοι (θρησκευτικά γεγονότα)
notation: 1793
preferred label: Synods (events) @en
type: Concept
broader: Θρησκευτικά γεγονότα

Θρησκευτική μεταστροφή
notation: 1791
preferred label: Religious conversion @en
type: Concept
broader: Θρησκευτικά γεγονότα

HUMANITIES-THESAURUS
type: ConceptScheme

Γεγονότα - συμβάντα
notation: 20
preferred label: Events @en
type: Concept
narrower: Θρησκευτικά γεγονότα

Σχίσματα
notation: 1792
preferred label: Schisms @en
type: Concept
broader: Θρησκευτικά γεγονότα

Θρησκευτικά γεγονότα
scope note: Γεγονότα που δεν εντάσσονται στη λατρευτική πρακτική των εκάστοτε θρησκειών (π.χ. προσευχή, λειτουργία, βάπτισμα), αλλά αφορούν την εξέλιξη των θρησκειών και των θρησκευτικών οργανισμών (π.χ. Εκκλησίες) στον χρόνο και προσδιορίζουν αλλαγές ως προς τις σχέσεις μεταξύ τους, όπως και μεταξύ αυτών και άλλων κοινωνικών, πολιτικών και οικονομικών δρώντων.
scope note: Events that are not included in worship practices (e.g. prayer, liturgy, baptism), but refer to the development of religions and religious organisations (e.g. Churches) over time, and designate changes in the relations between them, as well as between them and other social, political, and economic agents. @en
created: 2019-06-27
in scheme: HUMANITIES-THESAURUS
source: Sand & Sørensen 1999
preferred label: Religious events @en
narrower: Θρησκευτική μεταστροφή
narrower: Σχίσματα
narrower: Σύνοδοι (θρησκευτικά γεγονότα)
status: Εκδοθείς
creator: Tzedopoulos Giorgos (AA) @de
creator: Τζεδόπουλος Γιώργος (ΑΑ)
notation: 1790
contributor: Κατσιαδάκη Ελένη (ΑΑ)
contributor: Katsiadakis Helen (AA) @en
broader: Γεγονότα - συμβάντα
type: Concept
modified: 2019-08-20