HUMANITIES-THESAURUS
type: ConceptScheme

Μουφτής
scope note: Expert and interpreter of the Muslim holy law. The muftis issued legal opinions (fetvas) on particular cases. Although they were not binding for the decisions of the court, the legal opinions carried weight in the handling of the eventual cases. In the Ottoman Empire the state established the office of grand mufti (Shaykh al-Islām). His legal opinions were particularly important for the legitimation of state policies. @en
scope note: Γνώστης και ερμηνευτής του ιερού νόμου. Οι μουφτήδες εξέδιδαν γνωμοδοτήσεις (φετβάδες) επί συγκεκριμένων υποθέσεων. Αν και δεν ήταν δεσμευτικές ως προς τις δικαστικές αποφάσεις, οι γνωμοδοτήσεις τους είχαν βαρύνοντα ρόλο. Στην Οθωμανική Αυτοκρατορία είχε καθιερωθεί το κρατικό αξίωμα του μεγάλου μουφτή (σεϊχουλισλάμη), οι γνωμοδοτήσεις του οποίου είχαν καίρια σημασία για τη νομιμοποίηση της κρατικής πολιτικής.
created: 2019-06-24
creator: Τζεδόπουλος Γιώργος (ΑΑ)
creator: Tzedopoulos Giorgos (AA) @de
notation: 1785
preferred label: Mufti @en
contributor: Κατσιαδάκη Ελένη (ΑΑ)
contributor: Katsiadakis Helen (AA) @en
modified: 2019-08-20
broader: Μουσουλμανικά θρησκευτικά αξιώματα
type: Concept
source: Çakmak 2017
status: Εκδοθείς
in scheme: HUMANITIES-THESAURUS

Μουσουλμανικά θρησκευτικά αξιώματα
notation: 1783
preferred label: Muslim religious offices @en
type: Concept
narrower: Μουφτής