Συγγραφεύς (περίοδος πόλης-κράτους)
notation: 1778
preferred label: Syngrapheys (city-state period) @en
type: Concept
related: Συγγραφές (περίοδος πόλης-κράτους)

Συγγραφείς (περίοδος πόλης-κράτους)
notation: 1767
preferred label: Syngrapheis (city-state period) @en
type: Concept
related: Συγγραφές (περίοδος πόλης-κράτους)

HUMANITIES-THESAURUS
type: ConceptScheme

Πληροφοριακά αντικείμενα
notation: 240
preferred label: Information objects @en
type: Concept
narrower: Συγγραφές (περίοδος πόλης-κράτους)

Συγγραφές (περίοδος πόλης-κράτους)
preferred label: Syngraphai (city-state period) @en
source: Ζαββού 2007
related: Συγγραφείς (περίοδος πόλης-κράτους)
related: Συγγραφεύς (περίοδος πόλης-κράτους)
related: Οικοδομικές επιγραφές
type: Concept
scope note: Τύπος μελέτης για δημόσια έργα που εκπονούσαν ειδικές επιτροπές (συγγραφείς) στην αρχαία Αθήνα. Πρόκειται για την πρόταση των συγγραφέων, δηλαδή τη γενική περιγραφή του δημόσιου έργου, μία οικονομοτεχνική μελέτη που συνήθως αφορούσε τμήματα ενός έργου, ενώ κατά τμήματα μπορούσε να γίνει και η ανάθεση του έργου.
scope note: Type of study for public works prepared by specialised committees (syngrapheis) in ancient Athens. This is the proposal of the syngrapheis, i.e. the general description of the public work, a financial and technical study which was usually related to parts of the construction. Construction projects could be assigned in sections. @en
creator: Χρυσοβιτσάνος Γεράσιμος (ΑΑ)
creator: Chrysovitsanos Gerasimos (AA) @la
status: Εκδοθείς
contributor: Katsiadakis Helen (AA) @en
contributor: Κατσιαδάκη Ελένη (ΑΑ)
notation: 1777
in scheme: HUMANITIES-THESAURUS
broader: Πληροφοριακά αντικείμενα
modified: 2019-10-27
created: 2019-06-24

Οικοδομικές επιγραφές
notation: 1082
preferred label: Building inscriptions @en
type: Concept
related: Συγγραφές (περίοδος πόλης-κράτους)