Υπουργός εξωτερικών
notation: 1755
preferred label: Minister of Foreign Affairs @en
type: Concept
broader: Υπουργός

HUMANITIES-THESAURUS
type: ConceptScheme

Υπουργός
source: Laver & Shepsle 1994
status: Εκδοθείς
type: Concept
scope note: Head of a goverment department. In contemporary republics, ministers are politicians appointed by the head of the executive (prime minister or president) and, according to the degree, in which the distinction of powers is implemented, they may be members of Parliament or not. In parliamentary republics and constitutional monarchies, the ministers form a collective body (Cabinet) that convenes under the prime minister, while in presidential republics ministers (called secretaries in the USA) have advisory functions as to the overall decision-making of the government. @en
scope note: Ο επικεφαλής και υπεύθυνος ενός κυβερνητικού κλάδου. Στις σύγχρονες δημοκρατίες, οι υπουργοί είναι πολιτικά πρόσωπα που ορίζονται από τον επικεφαλής της εκτελεστικής εξουσίας (πρωθυπουργό ή πρόεδρο) και, ανάλογα με τον βαθμό εφαρμογής της διάκρισης των εξουσιών, μπορούν να είναι μέλη του κοινοβουλίου ή όχι. Στις κοινοβουλευτικές δημοκρατίες και τις συνταγματικές μοναρχίες, οι υπουργοί συναπαρτίζουν το υπουργικό συμβούλιο που συνεδριάζει υπό τον πρωθυπουργό, ενώ στις προεδρικές δημοκρατίες οι υπουργοί έχουν περισσότερο συμβουλευτικό ρόλο ως προς τη λήψη συνολικών κυβερνητικών αποφάσεων.
contributor: Katsiadakis Helen (AA) @en
contributor: Κατσιαδάκη Ελένη (ΑΑ)
creator: Tzedopoulos Giorgos (AA) @de
creator: Τζεδόπουλος Γιώργος (ΑΑ)
narrower: Υπουργός εξωτερικών
in scheme: HUMANITIES-THESAURUS
notation: 1750
modified: 2019-07-17
preferred label: Minister (government office) @en
created: 2019-06-12
broader: Πολιτικά αξιώματα

Πολιτικά αξιώματα
notation: 1696
preferred label: Political offices @en
type: Concept
narrower: Υπουργός