Μελισσοκομία
in scheme: HUMANITIES-THESAURUS
modified: 2019-08-20
source: Britannica Concise Encyclopedia 2006
type: Concept
broader: Κτηνοτροφία
contributor: Κατσιαδάκη Ελένη (ΑΑ)
contributor: Katsiadakis Helen (AA) @en
notation: 1703
scope note: Συστηματική φροντίδα και διαχείριση μελισσών, ούτως ώστε να παράξουν και να αποθηκεύσουν περίσσια μελιού, προκείμενου αυτό να συλλεχθεί. Οι μέλισσες εκτρέφονται, επίσης, και για άλλα προϊόντα που παράγουν ή για την επικονιαστική τους δράση στα καλλιεργούμενα φυτά. Η μελισσοκομία αποτελεί μια από τις παλαιότερες μορφές κτηνοτροφίας.
scope note: Care and manipulation of honeybees to enable them to produce and store more honey than they need so that the excess can be collected. Honeybees are also kept for other products they produce or their services as pollinators of fruit and vegetable blossoms. Beekeeping is one of the oldest forms of animal husbandry. @en
preferred label: Beekeeping @en
creator: Ιακωβίδου Αθηνά (ΑΑ)
creator: Iakovidou Athena (AA) @la
status: Εκδοθείς
created: 2019-05-22

Κτηνοτροφία
notation: 38
preferred label: Animal husbandry @en
type: Concept
narrower: Μελισσοκομία

HUMANITIES-THESAURUS
type: ConceptScheme