HUMANITIES-THESAURUS
type: ConceptScheme

Συνυπωνυμία
scope note: Το σύνολο των όρων οι οποίοι είναι υπώνυμα του ίδιου υπερκείμενου όρου ονομάζονται συνυπώνυμα, π.χ. βιολί, κιθάρα, πιάνο είναι συνεπώνυμα του όρου μουσικά όργανα.
scope note: Two or more predicates are co-hyponyms (or 'cohyponyms') when they are hyponyms of the same hyperonym. Example: 'dog' and 'cat' (common hyperonyms: animal, pet, mammal, etc. Co-hyponyms may or may not be incompatibles. @en
source: Crystal 2008
source: Saeed 2017
source: Ξυδόπουλος 2008
contributor: Κατσιαδάκη Ελένη (ΑΑ)
contributor: Katsiadakis Helen (AA) @en
notation: 1698
preferred label: Cohyponymy @en
creator: Karasimos Athanasios (AA) @fr
creator: Καρασίμος Αθανάσιος (ΑΑ)
broader: Υπωνυμία
alternative label: Co-hyponymy @en
type: Concept
in scheme: HUMANITIES-THESAURUS
status: Εκδοθείς
modified: 2020-08-21
created: 2019-05-20

Υπωνυμία
notation: 1525
preferred label: Hyponymy @en
type: Concept
narrower: Συνυπωνυμία