HUMANITIES-THESAURUS
type: ConceptScheme

Εκβιομηχάνιση
preferred label: Industrialisation @en
creator: Μεργούπη-Σαβαΐδου Ειρήνη (ΑΑ)
creator: Mergoupi-Savaidou Eirini (AA) @en
contributor: Katsiadakis Helen (AA) @en
contributor: Κατσιαδάκη Ελένη (ΑΑ)
status: Εκδοθείς
scope note: Historical process which marks the transformation of a (local, regional, national, continental, or global) economy to an industrial one. The reallocation of capital, labour and other resources towards industry induces extensive and complex economic, social, cultural, political, geopolitical, as well as technological changes. @en
scope note: Ιστορική διαδικασία κατά την οποία λαμβάνει χώρα ο μετασχηματισμός μιας (τοπικής, περιφερειακής, εθνικής, ηπειρωτικής ή παγκόσμιας) οικονομίας σε βιομηχανική. Η ανακατανομή κεφαλαίου, εργασίας και άλλων πόρων προς τη βιομηχανία επιφέρει σύνθετες οικονομικές, κοινωνικές, πολιτικές, γεωπολιτικές και πολιτισμικές αλλαγές, καθώς επίσης και μεταβολές στην τεχνολογία.
related: Ιστορία της τεχνολογίας
related: Βιομηχανική αρχαιολογία
related: Διεθνείς εκθέσεις
broader: Γεγονότα - συμβάντα
created: 2019-04-18
source: O’Brien 2010
source: O'Brien 2001
notation: 1678
type: Concept
in scheme: HUMANITIES-THESAURUS
modified: 2020-01-15
alternative label: Βιομηχανοποίηση

Ιστορία της τεχνολογίας
notation: 2470
preferred label: History of technology @en
type: Concept
related: Εκβιομηχάνιση

Γεγονότα - συμβάντα
notation: 20
preferred label: Events @en
type: Concept
narrower: Εκβιομηχάνιση

Βιομηχανική αρχαιολογία
notation: 1463
preferred label: Industrial archaeology @en
type: Concept
related: Εκβιομηχάνιση

Διεθνείς εκθέσεις
notation: 2221
preferred label: International exhibitions @en
preferred label: Expositions universelles @fr
type: Concept
related: Εκβιομηχάνιση