Νομίσματα (πληροφοριακά αντικείμενα)
notation: 1445
preferred label: Coins (information objects) @en
type: Concept
related: Νομισματικός άρχων

HUMANITIES-THESAURUS
type: ConceptScheme

Νομισματικός άρχων
type: Concept
source: Παπαευθυμίου 2010
source: Meadows 2016
scope note: The official, whether elected or appointed, responsible for oversight of the production of coins. The names of many private individuals that appear on ancient coins, either with monograms, or symbols or with their full signatures, are sometimes assumed to be those of mint magistrates. @en
scope note: Ο αξιωματούχος, εκλεγμένος ή διορισμένος, υπεύθυνος για την παραγωγή των νομισμάτων. Τα ονόματα πολλών ιδιωτών που εμφανίζονται χαραγμένα σε αρχαία νομίσματα, είτε με μονόγραμμα, είτε με σύμβολο είτε με την πλήρη υπογραφή, ανήκουν κάποιες φορές σε νομισματικούς άρχοντες.
related: Νομισματική
related: Νομίσματα (πληροφοριακά αντικείμενα)
contributor: Ιακωβίδου Αθηνά (ΑΑ)
contributor: Iakovidou Athena (AA) @la
created: 2019-04-11
status: Εκδοθείς
preferred label: Mint magistrate @en
broader: Πολιτικά αξιώματα
in scheme: HUMANITIES-THESAURUS
modified: 2020-04-03
creator: Ιακωβίδου Αθηνά (ΑΑ)
creator: Iakovidou Athena (AA) @fr
notation: 1660

Πολιτικά αξιώματα
notation: 1696
preferred label: Political offices @en
type: Concept
narrower: Νομισματικός άρχων

Νομισματική
notation: 1444
preferred label: Numismatics @en
type: Concept
related: Νομισματικός άρχων