HUMANITIES-THESAURUS
type: ConceptScheme

Βιβλιακή γραφή
modified: 2019-08-09
status: Εκδοθείς
contributor: Κατσιαδάκη Ελένη (ΑΑ)
contributor: Katsiadakis Helen (AA) @en
preferred label: Biblical script @en
scope note: Type of majuscule script which is encountered in official manuscripts during the Byzantine period. @en
scope note: Τύπος μεγαλογράμματης γραφής που χρησιμοποιούνταν σε επίσημα χειρόγραφα κατά τη Βυζαντινή περίοδο.
alternative label: Calligraphic script @en
alternative label: Καλλιτεχνική γραφή
notation: 1637
creator: Χρυσοβιτσάνος Γεράσιμος (ΑΑ)
creator: Chrysovitsanos Gerasimos (AA) @fr
source: Κριτζάς (επιμ.) 2003
broader: Μεγαλογράμματη γραφή
in scheme: HUMANITIES-THESAURUS
type: Concept
created: 2019-03-29

Μεγαλογράμματη γραφή
notation: 1636
preferred label: Majuscule script @en
type: Concept
narrower: Βιβλιακή γραφή