Νομίσματα (πληροφοριακά αντικείμενα)
notation: 1445
preferred label: Coins (information objects) @en
type: Concept
related: Εμπροσθότυποι

Συμβολικά αντικείμενα
notation: 22
preferred label: Symbolic objects @en
type: Concept
narrower: Εμπροσθότυποι

HUMANITIES-THESAURUS
type: ConceptScheme

Εμπροσθότυποι
type: Concept
preferred label: Obverses @en
contributor: Ιακωβίδου Αθηνά (ΑΑ)
contributor: Iakovidou Athena (AA) @la
scope note: Οι παραστάσεις που έφεραν τα νομίσματα στην εμπρόσθια, την κύρια πλευρά και παράγονταν από τις αντίστοιχες σφραγίδες. Πολύ συχνά οι εν λόγω απεικονίσεις αφορούσαν πορτραίτα ή άλλη μορφή κεφαλών, οι οποίες, κάποιες φορές, κυρίως από τους ελληνιστικούς χρόνους και μετά, παρέχουν μια ένδειξη για την αρχή που ήταν υπεύθυνη για την κοπή του νομίσματος.
scope note: The depictions on the head's side of a coin, produced by the obverse die. They are most often potraits or other forms of head which sometimes, mainly from the Hellenistic period onwards, provide an indication of the authority responsible for issuing the coin. @en
related: Νομισματική
related: Νομίσματα (πληροφοριακά αντικείμενα)
source: Meadows 2016
broader: Συμβολικά αντικείμενα
created: 2019-03-26
in scheme: HUMANITIES-THESAURUS
creator: Ιακωβίδου Αθηνά (ΑΑ)
creator: Iakovidou Athena (AA) @fr
notation: 1614
modified: 2020-04-03
status: Εκδοθείς

Νομισματική
notation: 1444
preferred label: Numismatics @en
type: Concept
related: Εμπροσθότυποι