HUMANITIES-THESAURUS
type: ConceptScheme

Μερωνυμία
notation: 1529
preferred label: Meronymy @en
type: Concept
narrower: Μερωνυμία μέλους

Μερωνυμία μέλους
status: Εκδοθείς
broader: Μερωνυμία
contributor: Κατσιαδάκη Ελένη (ΑΑ)
contributor: Katsiadakis Helen (AA) @en
modified: 2020-10-19
preferred label: Member meronymy @en
source: Riemer 2010
scope note: The relation of a member to a collection or an element to a set, such as sheep and flock, player and team. @en
scope note: Το είδος της μερωνυμίας το οποίο περιγράφει τη σχέση ανάμεσα στο μέλος και μία συλλογικότητα ή ανάμεσα στο στοιχείο και ένα σύνολο, όπως το πρόβατο με το κοπάδι και τον παίκτη με την ομάδα.
creator: Karasimos Athanasios (AA) @fr
creator: Καρασίμος Αθανάσιος (ΑΑ)
in scheme: HUMANITIES-THESAURUS
notation: 1531
type: Concept
created: 2019-03-14