Μερωνυμία τμήματος
notation: 1532
preferred label: Portion meronymy @en
type: Concept
broader: Μερωνυμία

Μερωνυμία συστατικών
notation: 1530
preferred label: Component meronymy @en
type: Concept
broader: Μερωνυμία

HUMANITIES-THESAURUS
type: ConceptScheme

Μερωνυμία
narrower: Μερωνυμία τμήματος
narrower: Μερωνυμία συστατικών
narrower: Μερωνυμία μέλους
in scheme: HUMANITIES-THESAURUS
source: Λεξικό της κοινής νεοελληνικής 1998
source: Zapata 2008
source: Crystal 2008
preferred label: Meronymy @en
created: 2019-03-14
contributor: Katsiadakis Helen (AA) @en
contributor: Κατσιαδάκη Ελένη (ΑΑ)
creator: Καρασίμος Αθανάσιος (ΑΑ)
creator: Karasimos Athanasios (AA) @fr
status: Εκδοθείς
broader: Υπωνυμία
modified: 2020-08-21
type: Concept
notation: 1529
scope note: Μερωνυμία είναι η σημασιολογική σχέση ανάμεσα σε λεξήματα που το ένα είναι τμήμα ή μέρος ενός άλλου. Π.χ. τα μάτια είναι τμήμα του προσώπου, η ρόδα είναι μέρος του αυτοκινήτου κλπ. Η μερωνυμία είναι το αντίθετο της ολωνυμίας και διακρίνεται από την υπωνυμία με βάση το είδος της σχέσης που συνάπτουν δύο -ή περισσότερα- λεξήματα: στη μερωνυμία η σχέση είναι «Α είναι μέρος/τμήμα του Β», ενώ στην υπωνυμία η σχέση είναι «Α είναι είδος του Β».
scope note: Meronymy is a semantic relation specific to linguistics, distinct from the similar metonymy. A meronym denotes a constituent part of, or a member of something. That is, "X" is a meronym of "Y" if Xs are parts of Y(s), or. @en

Μερωνυμία μέλους
notation: 1531
preferred label: Member meronymy @en
type: Concept
broader: Μερωνυμία

Υπωνυμία
notation: 1525
preferred label: Hyponymy @en
type: Concept
narrower: Μερωνυμία