HUMANITIES-THESAURUS
type: ConceptScheme

Hypernymy
creator: Karasimos Athanasios (AA) @la
creator: Καρασίμος Αθανάσιος (ΑΑ) @el
contributor: Κατσιαδάκη Ελένη (ΑΑ) @el
contributor: Katsiadakis Helen (AA)
broader: Hyponymy
preferred label: Υπερωνυμία @el
scope note: Η υπερωνυμία είναι η σχέση όπου υπάρχει ένας υπερκείμενος όρος σε μια σημασιολογική σχέση (ονομάζεται υπερώνυμο) αναφορικά με τον οποίο μπορεί να οριστεί ο υποκείμενος όρος, όπως συνήθως συμβαίνει στα λεξικά ("η γάτα είναι ένα είδος ζώου…"). @el
scope note: Hypernymy is the semantic relation between a more general word and a more specific word. Tree is a hyperonym of oak, because the set of trees includes the set of oaks. Hyperonymy is the converse of hyponymy.
status: Εκδοθείς
source: Ξυδόπουλος 2008
source: Zapata 2008
source: Crystal 2008
alternative label: Umbrella term
alternative label: Blanket term
alternative label: Superordinate
notation: 1526
created: 2019-03-14
type: Concept
in scheme: HUMANITIES-THESAURUS
modified: 2020-08-21

Hyponymy
notation: 1525
preferred label: Υπωνυμία @el
type: Concept
narrower: Hypernymy