Αντωνυμία (Σχέση)
in scheme: HUMANITIES-THESAURUS
preferred label: Antonymy @en
contributor: Karasimos Athanasios (AA) @en
contributor: Καρασίμος Αθανάσιος (ΑΑ)
status: Εκδοθείς
modified: 2020-07-15
scope note: Antonymy is the semantic relationship that exists between two (or more) words that have opposite meanings. The pairs of words which have opposite meanings are called antonyms. Antonymous pairs of words usually belong to the same grammatical category (i.e., both elements are nouns, or both are adjectives, or both are verbs, and so on). @en
scope note: Η αντωνυμία χρησιμοποιείται στη σημασιολογία ως μέρος της μελέτης της αντιθετικότητας της σημασίας. Η αντωνυμία είναι μία από τις εννοιακές σχέσεις που αναγνωρίζεται σε αναλύσεις της σημασίας μαζί με τη συνωνυμία, την υπωνυμία, την ασυμβατότητα, κτλ. Με τη γενικότερη έννοιά του, ο όρος αναφέρεται συνολικά σε όλα τα είδη σημασιολογικής αντιθετικότητας συμπεριλαμβανομένων και των διαβαθμίσεων αντίθεσης.
creator: Karasimos Athanasios (AA) @fr
creator: Καρασίμος Αθανάσιος (ΑΑ)
narrower: Μη διαβαθμισμένη αντωνυμία
narrower: Συσχετιστική αντωνυμία
narrower: Διαβαθμισμένη αντωνυμία
source: Zapata 2008
source: Ξυδόπουλος 2008
source: Saeed 2017
notation: 1517
broader: Σημασιολογικές σχέσεις
type: Concept
created: 2019-03-14

HUMANITIES-THESAURUS
type: ConceptScheme

Σημασιολογικές σχέσεις
notation: 1513
preferred label: Semantic relations @en
type: Concept
narrower: Αντωνυμία (Σχέση)

Συσχετιστική αντωνυμία
notation: 1689
preferred label: Relational antonymy @en
type: Concept
broader: Αντωνυμία (Σχέση)

Διαβαθμισμένη αντωνυμία
notation: 1520
preferred label: Gradable antonymy @en
type: Concept
broader: Αντωνυμία (Σχέση)

Μη διαβαθμισμένη αντωνυμία
notation: 1519
preferred label: Ungraded antonymy @en
type: Concept
broader: Αντωνυμία (Σχέση)