HUMANITIES-THESAURUS
type: ConceptScheme

Αρχαιολογία
notation: 1475
preferred label: Archaeology @en
type: Concept
narrower: Γεωαρχαιολογία

Γεωαρχαιολογία
type: Concept
status: Εκδοθείς
in scheme: HUMANITIES-THESAURUS
preferred label: Geoarchaeology @en
creator: Iakovidou Athena (AA) @fr
creator: Ιακωβίδου Αθηνά (ΑΑ)
created: 2018-12-11
scope note: The discipline that uses geoscience methods, techniques and concepts in solving archaeological problems. Geoarchaeology aims to recognize how natural and human induced processes alter the landscape. Also it aims to reconstruct the landscape for understanding site locations and distributions as well as the formation processes that built and preserved the site. The methods used derive from various fields of study such as geomorphology, climatology, geochronology, stratigraphy, soil science, sedimentology, and geoecology. @en
scope note: Ο επιστημονικός κλάδος που εφαρμόζει μεθόδους, πρακτικές και έννοιες των επιστημών της γης για την επίλυση αρχαιολογικών προβλημάτων. Σκοπός του κλάδου είναι να κατανοήσει πώς οι φυσικές και οι ανθρωπογενείς διαδικασίες διαμορφώνουν μια αρχαιολογική θέση, αλλά και να αναλύσει τις συνθήκες οι οποίες καθόρισαν τον τόπο της αρχαιολογικής θέσης, το σχηματισμό της ως αρχαιολογική απόθεση και την επακόλουθη διατήρησή της. Οι μέθοδοι που χρησιμοποιούνται είναι πολλές και προέρχονται από διαφορετικά γνωστικά πεδία εφαρμογής όπως η γεωμορφολογία, η κλιματολογία, η γεωχρονολόγηση, η στρωματογραφία, η εδαφολογία, η ιζηματολογία, και η γεωοικολογία.
contributor: Katsiadakis Helen (AA) @en
contributor: Κατσιαδάκη Ελένη (ΑΑ)
broader: Αρχαιολογία
modified: 2019-02-13
source: Καρκανάς 2008
notation: 1478