Μονογράμματα (Νομισματική)
notation: 2187
preferred label: Monograms (Numismatics) @en
type: Concept
related: Επισημάνσεις (Νομισματική)

Επισημάνσεις (Νομισματική)
related: Μονογράμματα (Νομισματική)
related: Νομίσματα (πληροφοριακά αντικείμενα)
related: Νομισματική
source: Κρεμύδη 2009
source: Παπαευθυμίου 2010
scope note: Γράμματα, επιγραφές, αριθμοί ή άλλα σύμβολα με τα οποία σφραγιζόταν ένα νόμισμα αφού είχε τεθεί σε κυκλοφορία. Οι επισημάνσεις συνήθως αποσκοπούσαν στην επιβεβαίωση της αξίας ενός παλαιού νομίσματος, στην αποδοχή της κυκλοφορίας του σε μια νέα περιοχή ή στην αλλαγή της ονομαστικής του αξίας.
scope note: Letters, inscriptions, numbers or other symbols punched into a coin at some point during its circulation. These marks were usually added to confirm the value of an old coin, accept its usage in a new area or change its face value. @en
modified: 2020-04-04
preferred label: Countermarks (Numismatics) @en
status: Εκδοθείς
contributor: Κατσιαδάκη Ελένη (ΑΑ)
contributor: Katsiadakis Helen (AA) @en
notation: 1453
created: 2018-09-01
broader: Συμβολικά αντικείμενα
creator: Ιακωβίδου Αθηνά (ΑΑ)
creator: Iakovidou Athena (AA) @fr
in scheme: HUMANITIES-THESAURUS
type: Concept

Νομίσματα (πληροφοριακά αντικείμενα)
notation: 1445
preferred label: Coins (information objects) @en
type: Concept
related: Επισημάνσεις (Νομισματική)

Συμβολικά αντικείμενα
notation: 22
preferred label: Symbolic objects @en
type: Concept
narrower: Επισημάνσεις (Νομισματική)

HUMANITIES-THESAURUS
type: ConceptScheme

Νομισματική
notation: 1444
preferred label: Numismatics @en
type: Concept
related: Επισημάνσεις (Νομισματική)