Νομίσματα (υλικό)
notation: 2349
preferred label: Coins (material) @en
type: Concept
narrower: Διπλοχτυπημένα νομίσματα

Διπλοχτυπημένα νομίσματα
scope note: Νομίσματα των οποίων η εμπρόσθια ή η οπίσθια όψη έχει χτυπηθεί από την αντίστοιχη μήτρα δύο φορές. Ως αποτέλεσμα της πράξης αυτής, εσκεμμένης ή μη, σημεία της παράστασης μπορεί να είναι διακριτά δύο φορές.
scope note: The term refers to coins whose obverse or reverse has been struck twice by the respective die. As a consequence of this action, deliberate or not, parts of the design may be visible twice. @en
notation: 1451
broader: Νομίσματα (υλικό)
created: 2018-08-31
source: Amandry, Dhénin, Popoff, Thierry, & Vellet 2002
contributor: Κατσιαδάκη Ελένη (ΑΑ)
contributor: Katsiadakis Helen (AA) @en
in scheme: HUMANITIES-THESAURUS
status: Εκδοθείς
type: Concept
modified: 2020-04-03
preferred label: Double struck coins @en
creator: Ιακωβίδου Αθηνά (ΑΑ)
creator: Iakovidou Athena (AA) @fr
related: Νομισματική

Νομισματική
notation: 1444
preferred label: Numismatics @en
type: Concept
related: Διπλοχτυπημένα νομίσματα

HUMANITIES-THESAURUS
type: ConceptScheme