HUMANITIES-THESAURUS
type: ConceptScheme

Πρόληψη (Αφηγηματολογία-Μέθοδοι)
notation: 1325
preferred label: Prolepsis (Narratology-Methods) @en
type: Concept
narrower: Εξωτερική πρόληψη

Εξωτερική πρόληψη
creator: Kalafata Patritsia (AA) @la
creator: Καλαφατά Πατρίτσια (ΑΑ)
scope note: Η πρόληψη της οποίας η ιστορία δεν αναμειγνύεται με την ιστορία της πρώτης αφήγησης.
scope note: External prolepsis concerns events which fall outside the time span of the main story. @en
preferred label: External prolepsis @en
created: 2015-09-29
broader: Πρόληψη (Αφηγηματολογία-Μέθοδοι)
type: Concept
status: Εκδοθείς
contributor: Katsiadakis Helen (AA) @en
contributor: Κατσιαδάκη Ελένη (ΑΑ)
in scheme: HUMANITIES-THESAURUS
modified: 2019-05-14
source: De Jong, I. 2012
notation: 1402