HUMANITIES-THESAURUS
type: ConceptScheme

Ενδοιαστικές προτάσεις
contributor: Κατσιαδάκη Ελένη (ΑΑ)
contributor: Katsiadakis Helen (AA) @en
scope note: Ενδοιαστικές λέγονται οι προτάσεις που εισάγονται με τους διστακτικούς συνδέσμους μη (να μη), μήπως και εκφράζουν κάποιο φόβο, δισταγμό (ενδοιασμό) για κάτι δυσάρεστο που μπορεί να συμβεί ή να μη συμβεί. Εξαρτώνται από ρήματα που εκφράζουν φόβο ή ανησυχία, π.χ. φοβάμαι, ανησυχώ, τρέμω, τρομάζω, αγωνιώ κ.ά.και που εκφράζουν υποψία ή προφύλαξη, π.χ. υποπτεύομαι, υποψιάζομαι, προσέχω, προφυλάγομαι κ.ά. Χρησιμοποιούνται ως αντικείμενο, ως επεξήγηση και υποκείμενο (σπάνια).
scope note: Hesitational clauses are introduced with the hesitant conjuctions like 'not to', or it expresses some fear, hesitation about something unpleasant that may or may not happen. These clauses depend on verbs that express fear or anxiety, and they are used as an object, as an explanation and as a subject (rarely). @en
preferred label: Hesitational clauses @en
creator: Καρασίμος Αθανάσιος (ΑΑ)
creator: Karasimos Athanasios (AA) @fr
status: Εκδοθείς
modified: 2019-02-14
broader: Δευτερεύουσες ονοματικές προτάσεις
source: Τριανταφυλλίδης 1977
source: Κλαίρης & Μπαμπινιώτης 2005
source: Τσοπανάκης 1998
source: Τσολάκης 1983
in scheme: HUMANITIES-THESAURUS
type: Concept
notation: 1328
created: 2015-07-24

Δευτερεύουσες ονοματικές προτάσεις
notation: 785
preferred label: Subordinate noun clauses @en
type: Concept
narrower: Ενδοιαστικές προτάσεις