HUMANITIES-THESAURUS
type: ConceptScheme

Volitional clauses
in scheme: HUMANITIES-THESAURUS
source: Τσοπανάκης 1998
source: Κλαίρης & Μπαμπινιώτης 2005
source: Τσολάκης 1983
source: Τριανταφυλλίδης 1977
preferred label: Βουλητικές προτάσεις @el
creator: Karasimos Athanasios (AA)
creator: Καρασίμος Αθανάσιος (ΑΑ) @el
created: 2015-01-23
contributor: Katsiadakis Helen (AA)
contributor: Κατσιαδάκη Ελένη (ΑΑ) @el
scope note: Volitional clauses are noun sentences introduced with the conjunction 'to' as a complement to the meaning of a verb or, sometimes, of a name. They follow the verbs with austere, linguistic, prohibitive, aesthetic meaning and are used as the subject or as the object of specific verbal categories.
scope note: Βουλητικές λέγονται οι δευτερεύουσες ονοματικές προτάσεις που εισάγονται με το μόριο να και συμπληρώνουν την έννοια ενός ρήματος ή, κάποιες φορές, ενός ονόματος. Συμπληρώνουν ρήματα βουλητικά, κελευστικά,απαγορευτικά, αισθητικά και χρησιμοποιούνται ως υποκείμενο των απρόσωπων ρημάτων ή εκφράσεων, ως αντικείμενο, ως επεξήγηση, ως ονοματικός προσδιορισμός και ως επιρρηματικός προσδιορισμός μετά από προθέσεις. @el
notation: 1316
status: Εκδοθείς
modified: 2019-02-14
broader: Subordinate noun clauses
type: Concept

Subordinate noun clauses
notation: 785
preferred label: Δευτερεύουσες ονοματικές προτάσεις @el
type: Concept
narrower: Volitional clauses