HUMANITIES-THESAURUS
type: ConceptScheme

Genitive of value
contributor: Katsiadakis Helen (AA)
contributor: Κατσιαδάκη Ελένη (ΑΑ) @el
preferred label: Γενική της αξίας @el
alternative label: Genitive of price
alternative label: Γενική του τιμήματος @el
notation: 1305
modified: 2020-04-08
source: Μπαχαράκης 2010
scope note: Ο ονοματικός προσδιορισμός σε γενική πτώση, ο οποίος δηλώνει την αξία του προσδιοριζόμενου ουσιαστικού ή επιθέτου. @el
scope note: Shows the value (typically monetary) of an object.
creator: Χατζημιχαήλ Χρήστος (ΑΑ) @el
creator: Chatzimichail Christos (AA)
type: Concept
status: Εκδοθείς
broader: Attribute in the genitive case
created: 2015-07-03
in scheme: HUMANITIES-THESAURUS

Attribute in the genitive case
notation: 958
preferred label: Προσδιορισμός σε γενική πτώση @el
type: Concept
narrower: Genitive of value