Σκηνικοί χώροι
creator: Γουλή Ελένη (ΑΑ)
creator: Goulis Helen (AA) @la
related: Δραματικοί χώροι
source: Pavis 2007
source: Πούχνερ 2011
broader: Δομικά μέρη υλικών αντικειμένων
in scheme: HUMANITIES-THESAURUS
preferred label: Espaces scéniques @fr
preferred label: Stage spaces @en
preferred label: Bühnenräume @de
scope note: Ως σκηνικός νοείται ο χώρος της σκηνής και του σκηνικού με τις ποικίλες εκδοχές που είχε στην ιστορία του θεάτρου (μόνιμο, εναλλασσόμενο, ρεαλιστικό, υπαινικτικό, απουσία σκηνικού, ζωγραφισμένο σε κουίντες, κτισμένο κ.λπ.). Ο όρος περιλαμβάνει επίσης τις καταπακτές, την περιστρεφόμενη σκηνή, άλλες τεχνικές εγκαταστάσεις και συστήματα φωτισμού.
scope note: Stage space is the actual space on stage and the set in its multiple variations in the course of theatre history (permanent, changing, no set at all, realistic, suggestive, painted on wings, built etc.). It comprises also the trap doors, the revolving stage, the other technical equipment and lighting systems. @en
contributor: Katsiadakis Helen (AA) @en
contributor: Κατσιαδάκη Ελένη (ΑΑ)
narrower: Σκηνικά
narrower: Σκηνές (χώροι)
status: Εκδοθείς
notation: 128
modified: 2019-02-12
type: Concept
created: 2015-10-21

Σκηνικά
notation: 2176
preferred label: Bühnenbilder @de
preferred label: Sets (Perfroming arts) @en
preferred label: Décors (Arts du spectacle) @fr
type: Concept
broader: Σκηνικοί χώροι

HUMANITIES-THESAURUS
type: ConceptScheme

Σκηνές (χώροι)
notation: 683
preferred label: Stages @en
preferred label: Scènes (espaces) @fr
preferred label: Bühne @de
type: Concept
broader: Σκηνικοί χώροι

Δραματικοί χώροι
notation: 728
preferred label: Dramatic spaces @en
preferred label: Espaces dramatiques @fr
preferred label: Dramatische Räume @de
type: Concept
related: Σκηνικοί χώροι

Δομικά μέρη υλικών αντικειμένων
notation: 17
preferred label: Structural parts of material objects @en
type: Concept
narrower: Σκηνικοί χώροι