Μορφολογία
contributor: Katsiadakis Helen (AA) @en
contributor: Κατσιαδάκη Ελένη (ΑΑ)
notation: 1278
modified: 2015-11-02
created: 2015-01-21
status: Εκδοθείς
preferred label: Morphology @en
preferred label: Morphologie @fr
source: Beard 1994
source: Ράλλη 2005
source: Booij 2007
source: Spencer & Zwicky 2001
creator: Karasimos Athanasios (AA) @fr
creator: Καρασίμος Αθανάσιος (ΑΑ)
in scheme: HUMANITIES-THESAURUS
scope note: Μορφολογία είναι: α) ο κλάδος της γλωσσολογίας που μελετά τις μικρότερες μορφικές μονάδες, τα μορφήματα, από τα οποία αποτελείται η λέξη, β) η ίδια η σύσταση των λέξεων από μορφήματα, λεξικά και γραμματικά.
scope note: In linguistics, morphology is the identification, analysis, and description of the structure of a given language's morphemes and other linguistic units, such as root words, affixes, parts of speech, intonations and stresses, or implied context. In contrast, morphological typology is the classification of languages according to their use of morphemes, while lexicology is the study of those words forming a language's wordstock. @en
broader: Μικρογλωσσολογία
type: Concept

Μικρογλωσσολογία
notation: 740
preferred label: Mikrolinguistique @fr
preferred label: Microlinguistics @en
type: Concept
narrower: Μορφολογία

HUMANITIES-THESAURUS
type: ConceptScheme