HUMANITIES-THESAURUS
type: ConceptScheme

Πλάγιες ερωτηματικές προτάσεις
contributor: Katsiadakis Helen (AA) @en
contributor: Κατσιαδάκη Ελένη (ΑΑ)
notation: 1238
source: Κλαίρης & Μπαμπινιώτης 2005
source: Τσοπανάκης 1998
source: Τσολάκης 1983
source: Τριανταφυλλίδης 1977
preferred label: Indirect question clauses @en
scope note: Indirect question (or indirect interrogative) clauses are questions inside a main clause or following a main clause. The same tense must be kept, and also the indicative mood (unless it is a deliberative question in subjunctive, in which case subjunctive tense must be kept). If, for instance, the original question is formulated in future tense, the verb of the indirect question will be in the future tense, regardless of the tense of the main clause. As in the cases of reported speech, the oblique optative can be used if the introductory verb is in a secondary tense, creating the so called secondary clause. @en
scope note: Όταν ένας ομιλητής μεταφέρει μια ευθεία ερώτηση σε κάποιον άλλο, η πρόταση λέγεται πλάγια ερώτηση ή πλάγια ερωτηματική πρόταση. Οι πλάγιες ερωτηματικές προτάσεις είναι δευτερεύουσες ονοματικές προτάσεις και εξαρτώνται από ρήματα που σημαίνουν ερώτηση, απορία, αμφιβολία, γνώση, αίσθηση κ.λπ., π.χ. ρωτώ, εξετάζω, απορώ, θαυμάζω, αμφιβάλλω, λέω, εξηγώ, σκέφτομαι, δείχνω, θυμάμαι, γράφω, βλέπω, κοιτάζω, μαθαίνω, πληροφορούμαι, ακούω, υποθέτω, μαντεύω, καταλαβαίνω, υπολογίζω, προσπαθώ, πασχίζω κ.ά. Επίσης διακρίνονται σε πλάγιες ερωτηματικές ολικής άγνοιας και μερικής άγνοιας, ανάλογα με την απάντηση που επιδέχονται.
broader: Δευτερεύουσες ονοματικές προτάσεις
in scheme: HUMANITIES-THESAURUS
modified: 2019-02-14
creator: Καρασίμος Αθανάσιος (ΑΑ)
creator: Karasimos Athanasios (AA) @fr
status: Εκδοθείς
type: Concept
created: 2015-01-23

Δευτερεύουσες ονοματικές προτάσεις
notation: 785
preferred label: Subordinate noun clauses @en
type: Concept
narrower: Πλάγιες ερωτηματικές προτάσεις