Σημασιολογία
type: Concept
contributor: Κατσιαδάκη Ελένη (ΑΑ)
contributor: Katsiadakis Helen (AA) @en
in scheme: HUMANITIES-THESAURUS
source: Lyons 1999
source: Bussmann 1996
source: Βελούδης 2005
preferred label: Sémantique @fr
preferred label: Sematics @en
preferred label: Semantik @de
created: 2015-01-21
status: Εκδοθείς
creator: Καρασίμος Αθανάσιος (ΑΑ)
creator: Karasimos Athanasios (AA) @fr
modified: 2018-04-27
broader: Μικρογλωσσολογία
scope note: Semantics is the study of meaning. It focuses on the relation between signifiers, like words, phrases, signs, and symbols, and what they stand for. Linguistic semantics is the study of meaning that is used for understanding human expression through language. Other forms of semantics include the semantics of programming languages, formal logics, and semiotics. In international scientific vocabulary semantics is also called semasiology. @en
scope note: Ως Σημασιολογία ορίζεται κατά κανόνα η επιστημονική μελέτη της γλωσσικής σημασίας. Επικεντρώνεται στη σχέση μεταξύ σημαινόντων, όπως λέξεις, φράσεις και σύμβολα, καθώς και τι αντιπροσωπεύουν. Μελετά το νόημα που έχει χρησιμοποιηθεί για την κατανόηση της ανθρώπινης έκφρασης μέσω της γλώσσας. Άλλες μορφές της σημασιολογίας συμπεριλαμβάνουν τη σημασιολογία των γλωσσών προγραμματισμού, την τυπική λογική,την οντολογική αναπάρασταση γνώση και τη σημειολογία.
notation: 1232
alternative label: Semasiology @en

Μικρογλωσσολογία
notation: 740
preferred label: Mikrolinguistique @fr
preferred label: Microlinguistics @en
type: Concept
narrower: Σημασιολογία

HUMANITIES-THESAURUS
type: ConceptScheme