HUMANITIES-THESAURUS
type: ConceptScheme

Γενική αντικειμενική
type: Concept
source: Μπαχαράκης 2010
notation: 1224
status: Εκδοθείς
modified: 2020-04-08
preferred label: Objective genitive @en
in scheme: HUMANITIES-THESAURUS
creator: Chatzimichail Christos (AA) @en
creator: Χατζημιχαήλ Χρήστος (ΑΑ)
contributor: Katsiadakis Helen (AA) @en
contributor: Κατσιαδάκη Ελένη (ΑΑ)
scope note: Ο ονοματικός προσδιορισμός σε γενική πτώση, ο οποίος εκφράζει το αντικείμενο της ρηματικής ενέργειας, που υποδηλώνεται με το προσδιοριζόμενο ρηματικό όνομα (ουσιαστικό ή επίθετο).
scope note: The nominal phrase in the genitive case, which expresses the object of the verbal action, denoted by the identified verbal name (noun or adjective). @en
created: 2015-07-03
broader: Προσδιορισμός σε γενική πτώση

Προσδιορισμός σε γενική πτώση
notation: 958
preferred label: Attribute in the genitive case @en
type: Concept
narrower: Γενική αντικειμενική