HUMANITIES-THESAURUS
type: ConceptScheme

Partitive genitive
scope note: It is the genitive case which represents the whole or set of which the head of a partitive phrase is a portion or subset. Also, it can be a use or instance of such a genitive case.
scope note: Ο ονοματικός προσδιορισμός σε γενική πτώση, ο οποίος δηλώνει το διηρημένο όλον, μέρος του οποίου είναι το προσδιοριζόμενο. @el
alternative label: Wholative genitive
alternative label: Genitive of the whole
created: 2015-07-03
contributor: Κατσιαδάκη Ελένη (ΑΑ) @el
contributor: Katsiadakis Helen (AA)
creator: Χατζημιχαήλ Χρήστος (ΑΑ) @el
creator: Chatzimichail Christos (AA) @fr
in scheme: HUMANITIES-THESAURUS
preferred label: Γενική διαιρετική @el
modified: 2020-05-27
broader: Attribute in the genitive case
source: Μπαχαράκης 2010
status: Εκδοθείς
notation: 1145
type: Concept

Attribute in the genitive case
notation: 958
preferred label: Προσδιορισμός σε γενική πτώση @el
type: Concept
narrower: Partitive genitive