HUMANITIES-THESAURUS
type: ConceptScheme

Πραξικοπήματα
type: Concept
preferred label: Coups @en
scope note: Βίαιες προσπάθειες ανατροπής της εκάστοτε κυβέρνησης και κατάληψης της εξουσίας από πολιτικές ή/και στρατιωτικές ομάδες, οι οποίες κατά κανόνα δεν συνοδεύονται από συλλογικές κινητοποιήσεις.
scope note: Violent attempts to overthrow a government and to seize power by political and/or military groups. Coups, as a rule, are not accompanied by collective action. @en
status: Εκδοθείς
source: Moore 2011
notation: 1097
in scheme: HUMANITIES-THESAURUS
modified: 2018-11-08
creator: Tzedopoulos Giorgos (AA) @de
creator: Τζεδόπουλος Γιώργος (ΑΑ)
contributor: Κατσιαδάκη Ελένη (ΑΑ)
contributor: Katsiadakis Helen (AA) @en
broader: Πολιτική βία
created: 2015-07-14

Πολιτική βία
notation: 475
preferred label: Political violence @en
type: Concept
narrower: Πραξικοπήματα