Μελόδραμα
notation: 2303
preferred label: Μélodrame @fr
preferred label: Melodram @de
preferred label: Melodrama @en
type: Concept
broader: Δράμα

Ιστορικό δράμα
notation: 1212
preferred label: Historisches Drama @de
preferred label: Drame historique @fr
preferred label: Historical drama @en
type: Concept
broader: Δράμα

HUMANITIES-THESAURUS
type: ConceptScheme

Δραματικά είδη
notation: 717
preferred label: Dramatische Genres @de
preferred label: Dramatic genres @en
preferred label: Genres dramatiques @fr
type: Concept
narrower: Δράμα

Δράμα
source: Corvin 2008
source: Law 2011
broader: Δραματικά είδη
narrower: Μελόδραμα
narrower: Ιστορικό δράμα
type: Concept
creator: Γουλή Ελένη (ΑΑ)
creator: Goulis Helen (AA) @fr
contributor: Katsiadakis Helen (AA) @en
contributor: Κατσιαδάκη Ελένη (ΑΑ)
created: 2015-09-16
preferred label: Drama @en
preferred label: Drame @fr
preferred label: Schauspiel @de
scope note: Δραματικό είδος που αναπτύχθηκε στο δυτικό θέατρο, στα μέσα του 18ου αιώνα υπό την επήρεια των ιδεών του Διαφωτισμού, ως αντίστιξη στην κλασικιστική τραγωδία.Το δράμα στη νέα του μορφή πραγματεύεται σοβαρές καταστάσεις, έντονες αντιθέσεις και συγκρούσεις κοινών ανθρώπων και κινείται μεταξύ τραγωδίας και κωμωδίας.
scope note: Dramatic genre developed in the mid-18th century in western theatre under the influence of Enlightenment ideas, as a reaction to the classicist tragedy. The new form of drama deals with serious situations, intense confrontations and conflicts of common people, moving between tragedy and comedy. @en
modified: 2019-02-12
status: Εκδοθείς
notation: 1090
in scheme: HUMANITIES-THESAURUS