HUMANITIES-THESAURUS
type: ConceptScheme

Εφημεριδοπώλες
scope note: Πλανόδιοι πωλητές εφημερίδων και περιοδικών. Προμηθεύονταν τις εφημερίδες από το πρακτορείο. Περιφέρονταν στους δρόμους και τα πολυσύχναστα μαγαζιά (καφενεία, ταβέρνες κλπ) της γειτονιάς πεζοί έχοντας τις εφημερίδες στη μασχάλη ή με ποδήλατο. Αρκετοί προτιμούσαν να έχουν μόνιμο στέκι σε κάποια γωνία.Οι εφημεριδοπώλες, παλαιότερα τουλάχιστον, ήταν ως επί το πλείστον παιδιά ή έφηβοι.
scope note: Itinerant newspaper and magazine sellers. They obtained the newspapers from the agency and wandered around in the streets and busy shops (cafes, taverns, etc) of the neighborhood, on foot or by bicycle, the newspapers under their armpit. Several of them had a permanent hangout in some corner. In the past, they were mostly children or adolescents. @en
notation: 1018
contributor: Κατσιαδάκη Ελένη (ΑΑ)
contributor: Katsiadakis Helen (AA) @en
type: Concept
modified: 2018-12-29
preferred label: Paperboys @en
broader: Μικροπωλητές
source: Δαφέρμος 2007
created: 2015-10-21
creator: Φαλιέρου Αναστασία (ΑΑ)
creator: Falierou Anastasia (AA) @fr
status: Εκδοθείς
in scheme: HUMANITIES-THESAURUS

Μικροπωλητές
notation: 456
preferred label: Peddlers @en
type: Concept
narrower: Εφημεριδοπώλες