HUMANITIES-THESAURUS
type: ConceptScheme

Κετσετζήδες
notation: 1012
source: Δαφέρμος 2007
broader: Τεχνίτες
status: Εκδοθείς
type: Concept
creator: Φαλιέρου Αναστασία (ΑΑ)
creator: Falierou Anastasia (AA) @la
modified: 2018-12-29
in scheme: HUMANITIES-THESAURUS
contributor: Κατσιαδάκη Ελένη (ΑΑ)
contributor: Katsiadakis Helen (AA) @en
preferred label: Feltmakers @en
created: 2015-10-29
scope note: Οι τεχνίτες που ασχολούνταν με την κατασκευή του κετσέ, δηλαδή του συμπιεσμένου μαλλιού προβάτου, το οποίο χρησιμοποιούνταν στο εσωτερικό του σαμαριού.

Τεχνίτες
notation: 685
preferred label: Craftsmen @en
type: Concept
narrower: Κετσετζήδες