HUMANITIES-THESAURUS
type: ConceptScheme

Παγωτατζήδες
type: Concept
status: Εκδοθείς
source: Χαραλαμπάκης 2014
source: Δαφέρμος 2007
preferred label: Ice cream sellers @en
creator: Falierou Anastasia (AA) @la
creator: Φαλιέρου Αναστασία (ΑΑ)
broader: Μικροπωλητές
scope note: Πλανόδιοι πωλητές παγωτού. Γυρνούσαν στις γειτονιές και πωλούσαν παγωτά με διάφορες γεύσεις. Φορούσαν άσπρη ποδιά και άσπρο σκούφο. Συνήθως χρησιμοποιούσαν ποδήλατο και έσερναν το καρότσι με τα παγωτά.
scope note: Travelling ice cream sellers. They went around the neighborhoods and sold ice creams with various flavors. They wore a white apron and a white cap. They usually rode a bicycle and had a cart with ice creams. @en
contributor: Κατσιαδάκη Ελένη (ΑΑ)
contributor: Katsiadakis Helen (AA) @en
modified: 2018-12-29
in scheme: HUMANITIES-THESAURUS
created: 2015-08-06
notation: 965

Μικροπωλητές
type: Concept
notation: 456
preferred label: Peddlers @en
narrower: Παγωτατζήδες