Σαλεπιτζήδες
type: Concept
contributor: Katsiadakis Helen (AA) @en
contributor: Κατσιαδάκη Ελένη (ΑΑ)
notation: 909
status: Εκδοθείς
preferred label: Salep sellers @en
modified: 2018-12-29
scope note: Οι παρασκευαστές και πωλητές του σαλεπιού. Ήταν πλανόδιοι πωλητές και περιφέρονταν ντυμένοι στα άσπρα (άσπρη μπλούζα και καπέλο) και με τροχήλατη προθήκη. Τα σκεύη που χρησιμοποιούσαν ήταν μπρούτζινα αλλά πάντοτε καλογυαλισμένα και πεντακάθαρα. Η δουλειά του πύκνωνε τις πρωινές και τις βραδινές ώρες.
scope note: Manufacturers and sellers of salep. They were street sellers and walked around dressed in white (white blouse and hat) and pushing a cart. The utensils they used were bronze, always polished and impeccably clean. Their work peaked in the mornings and the evenings. @en
in scheme: HUMANITIES-THESAURUS
source: Χαραλαμπάκης 2014
creator: Φαλιέρου Αναστασία (ΑΑ)
creator: Falierou Anastasia (AA) @fr
created: 2015-07-29
broader: Μικροπωλητές

HUMANITIES-THESAURUS
type: ConceptScheme

Μικροπωλητές
type: Concept
notation: 456
preferred label: Peddlers @en
narrower: Σαλεπιτζήδες