HUMANITIES-THESAURUS
type: ConceptScheme

Μαραγκοί
type: Concept
contributor: Κατσιαδάκη Ελένη (ΑΑ)
contributor: Katsiadakis Helen (AA) @en
modified: 2018-12-29
alternative label: Ξυλουργοί
alternative label: Ντουλγκέρηδες
in scheme: HUMANITIES-THESAURUS
notation: 901
scope note: Τεχνίτες που ασχολούνται με την κατεργασία του ξύλου, την κατασκευή και επιδιόρθωση ξύλινων αντικειμένων και επιφανειών.
scope note: Craftsmen trained in woodworking, construction and repair of wooden objects and surfaces. @en
created: 2015-05-20
preferred label: Carpenters @en
status: Εκδοθείς
creator: Falierou Anastasia (AA) @de
creator: Φαλιέρου Αναστασία (ΑΑ)
source: Χαραλαμπάκης 2014
broader: Τεχνίτες

Τεχνίτες
type: Concept
notation: 685
preferred label: Craftsmen @en
narrower: Μαραγκοί