HUMANITIES-THESAURUS
type: ConceptScheme

Επιφώνημα
type: Concept
preferred label: Interjection @en
contributor: Κατσιαδάκη Ελένη (ΑΑ)
contributor: Katsiadakis Helen (AA) @en
creator: Χατζημιχαήλ Χρήστος (ΑΑ)
creator: Chatzimichail Christos (AA) @en
in scheme: HUMANITIES-THESAURUS
status: Εκδοθείς
notation: 881
scope note: Επιφωνήματα λέγονται οι άκλιτες λέξεις που φανερώνουν ψυχικό πάθημα, όπως θαυμασμό, ενθουσιασμό, χαρά ή αγανάκτηση, αποστροφή, λύπη κτλ.
scope note: An interjection is a word or expression that occurs as an utterance on its own and expresses a spontaneous feeling or reaction. The category is quite heterogeneous, and includes such things as exclamations, curses, greetings, responses, and hesitation. Due to its heterogeneous nature, the category of interjections partly overlaps with categories like profanities, discourse markers and fillers. @en
created: 2015-10-03
source: Οικονόμου 1999
broader: Άκλιτα μέρη
modified: 2020-05-27

Άκλιτα μέρη
type: Concept
notation: 681
preferred label: Uninflected @en
narrower: Επιφώνημα