Μαρμαράδες
type: Concept
contributor: Κατσιαδάκη Ελένη (ΑΑ)
contributor: Katsiadakis Helen (AA) @en
notation: 855
broader: Τεχνίτες
alternative label: Marble makers @en
status: Εκδοθείς
preferred label: Stonemasons @en
creator: Φαλιέρου Αναστασία (ΑΑ)
creator: Falierou Anastasia (AA) @la
modified: 2018-12-29
scope note: Τεχνίτες που ασχολούνται με την κατεργασία του μαρμάρου ή καλύπτουν επιφάνειες με μάρμαρο.
scope note: Craftsmen skilled in the extraction and processing of marble or in covering surfaces with marble. @en
source: Χαραλαμπάκης 2014
in scheme: HUMANITIES-THESAURUS
created: 2015-05-20

Τεχνίτες
type: Concept
notation: 685
preferred label: Craftsmen @en
narrower: Μαρμαράδες

HUMANITIES-THESAURUS
type: ConceptScheme