HUMANITIES-THESAURUS
type: ConceptScheme

Ομοιόπτωτος προσδιορισμός
type: Concept
notation: 374
preferred label: Agreeing modifier @en
narrower: Κατηγορηματικός προσδιορισμός

Κατηγορηματικός προσδιορισμός
type: Concept
notation: 850
source: Μπαχαράκης 2010
created: 2015-07-02
preferred label: Predicative adjective @en
status: Εκδοθείς
scope note: Κατηγορηματικός προσδιορισμός λέγεται το επίθετο που προσδιορίζει ένα ουσιαστικό, αποδίδοντας σε αυτό τη στιγμή της ενέργειας του ρήματος μια παροδική ιδιότητα, που διαρκεί όσο και η ρηματική ενέργεια. Η παροδική ιδιότητα που εκφράζει ο κατηγορηματικός προσδιορισμός διακρίνεται από άλλη διαφορετική ή αντίθετη ιδιότητα που θα μπορούσε να έχει το ίδιο ουσιαστικό σε άλλη στιγμή, με αποτέλεσμα να διαφοροποιεί το προσδιοριζόμενο από τον εαυτό του κατά τη διάρκεια της ρηματικής ενέργειας. Το καθιστά δηλαδή διαφορετικό από ό,τι ήταν πριν και από ό,τι ενδεχομένως θα είναι μετά. Δεν συνοδεύεται ποτέ από άρθρο, γι’ αυτό ως κατηγορηματικός προσδιορισμός τίθεται πάντοτε άναρθρο επίθετο ή ό,τι άλλο είναι ισοδύναμο με επίθετο.
contributor: Κατσιαδάκη Ελένη (ΑΑ)
contributor: Katsiadakis Helen (AA) @en
broader: Ομοιόπτωτος προσδιορισμός
alternative label: Predicative position @en
creator: Chatzimichail Christos (AA) @de
creator: Χατζημιχαήλ Χρήστος (ΑΑ)
modified: 2015-10-04
in scheme: HUMANITIES-THESAURUS