HUMANITIES-THESAURUS
type: ConceptScheme

Κωμωδία
type: Concept
preferred label: Comedy @en
preferred label: Comédie @fr
preferred label: Komödie @de
narrower: Κωμωδία ηθών
narrower: Φάρσα
modified: 2019-11-30
source: Πούχνερ 2001
source: Λεξικό 2007
source: Χατζηπανταζής 2004
contributor: Γουλή Ελένη (ΑΑ)
contributor: Goulis Helen (AA) @fr
broader: Δραματικά είδη
creator: Goulis Helen (AA) @la
creator: Γουλή Ελένη (ΑΑ)
in scheme: HUMANITIES-THESAURUS
status: Εκδοθείς
notation: 804
created: 2015-09-16
scope note: Δραματικό είδος που πραγματεύεται ζητήματα της καθημερινής ζωής των κοινών ανθρώπων, της κοινωνικής/πολιτικής πραγματικότητας και καταλήγει σε αίσιο τέλος (γάμο, συμφιλίωση, αναγνώριση κ.ο.κ.). Βασικές λειτουργίες της είναι η γελοιοποίηση της αποκλίνουσας συμπεριφοράς του κωμικού προσώπου και η πρόσκαιρη ανατροπή των φυσικών νόμων και της δεδομένης τάξης των πραγμάτων, η οποία στο τέλος -κατά κανόνα- αποκαθίσταται. Χρησιμοποιεί την αιφνίδια ιδέα, τις αλλαγές ρυθμού, το τυχαίο, τη δραματουργική και σκηνική εφευρετικότητα.
scope note: Dramatic genre drawing on everyday situations of ordinary people, on the social/political reality and having a happy ending (marriage, reconciliation, recognition etc.). Among the main functions of comedy are the mockery of the deviant behavior of the comic character and the temporary reversal of the natural laws and the established order, which are restored in the end. It uses the sudden brainwave, the changes in pace, chance and inventiveness in dramaturgy and staging. @en

Κωμωδία ηθών
type: Concept
notation: 1167
preferred label: Comedy of manners @en
preferred label: Comédie de mœurs @fr
preferred label: Gesellschaftskomödie @de
broader: Κωμωδία

Φάρσα
type: Concept
notation: 1805
preferred label: Farce @fr
broader: Κωμωδία

Δραματικά είδη
type: Concept
notation: 717
preferred label: Dramatische Genres @de
preferred label: Dramatic genres @en
preferred label: Genres dramatiques @fr
narrower: Κωμωδία