HUMANITIES-THESAURUS
type: ConceptScheme

Μαχαιράδες
type: Concept
preferred label: Cutlers @en
source: Δαφέρμος 2007
notation: 786
alternative label: Μαχαιροποιοί
creator: Falierou Anastasia (AA) @de
creator: Φαλιέρου Αναστασία (ΑΑ)
broader: Τεχνίτες
scope note: Οι τεχνίτες που ασχολούνται με την κατασκευή και επιδιόρθωση μαχαιριών.
scope note: Craftsmen involved in the manufacture and repair of knives. @en
in scheme: HUMANITIES-THESAURUS
created: 2015-10-25
contributor: Κατσιαδάκη Ελένη (ΑΑ)
contributor: Katsiadakis Helen (AA) @en
modified: 2018-12-29
status: Εκδοθείς

Τεχνίτες
type: Concept
notation: 685
preferred label: Craftsmen @en
narrower: Μαχαιράδες