Αιτιατική
type: Concept
contributor: Katsiadakis Helen (AA) @fr
contributor: Κατσιαδάκη Ελένη (ΑΑ)
notation: 710
source: Χαραλαμπάκης 2014
source: Μπαμπινιώτης 2005
broader: Πτώσεις (γραμματική)
scope note: The accusative case of a noun or adjective or participle is the grammatical case used to mark the direct object of a transitive verb. The same case is used in many languages for the objects of (some or all) prepositions. It is a noun that has something done to it, usually used together (such as in Latin) with the nominative case. The syntactic functions of the accusative consist of designating the immediate object of an action, the intended result, the goal of a motion, and the extent of an action. @en
scope note: Η πλάγια πτώση η οποία χρησιμοποιείται για να δηλωθεί το συμπλήρωμα της έννοιας του ρήματος, δηλαδή το άμεσο αντικείμενο του ρήματος. Χρησιμοποιείται επίσης για να εκφράσει διάφορες επιρρηματικές σχέσεις όπως τόπο, χρόνο, αιτία, αναφορά, τρόπο και ποινή.
related: Προσδιορισμός σε αιτιατική πτώση
status: Εκδοθείς
modified: 2020-04-08
creator: Chatzimichail Christos (AA) @en
creator: Χατζημιχαήλ Χρήστος (ΑΑ)
preferred label: Accusative @en
created: 2015-07-02
in scheme: HUMANITIES-THESAURUS

Πτώσεις (γραμματική)
type: Concept
notation: 48
preferred label: Cases (grammar) @en
narrower: Αιτιατική

Προσδιορισμός σε αιτιατική πτώση
type: Concept
notation: 809
preferred label: Attribute in the accusative case @en
related: Αιτιατική

HUMANITIES-THESAURUS
type: ConceptScheme