Εικαστικές Τέχνες
type: Concept
notation: 834
preferred label: Fine Arts @en
broader: Τέχνες

Παραστατικές τέχνες
type: Concept
notation: 1085
preferred label: Performing arts @en
preferred label: Darstellende Künste @de
preferred label: Arts du spectacle @fr
broader: Τέχνες

HUMANITIES-THESAURUS
type: ConceptScheme

Παραγωγή έργων & φαινομένων αισθητικής αξίας
type: Concept
notation: 89
preferred label: Production of works and/or phenomena of aesthetic value @en
narrower: Τέχνες

Τέχνες
type: Concept
narrower: Παραστατικές τέχνες
narrower: Εικαστικές Τέχνες
creator: Γουλή Ελένη (ΑΑ)
creator: Goulis Helen (AA) @la
scope note: Branches of creative activity comprising any process intending to the production of material objects, phenomena or experiences endowed with a significant degree of aesthetic interest. According to most art classification systems, they mainly include the visual and the performing arts. @en
scope note: Ως Τέχνες νοούνται οι τομείς καλλιτεχνικής δραστηριότητας που περιλαμβάνουν οιαδήποτε διαδικασία αποσκοπεί στην παραγωγή υλικών αντικειμένων ή τη δημιουργία φαινομένων ή εμπειριών αισθητικής αξίας. Κατά την επικρατέστερη κατηγοριοποίησή τους περιλαμβάνουν κυρίως τις εικαστικές και τις παραστατικές τέχνες.
notation: 597
broader: Παραγωγή έργων & φαινομένων αισθητικής αξίας
preferred label: Arts @en
preferred label: Künste @de
status: Εκδοθείς
contributor: Katsiadakis Helen (AA) @en
contributor: Κατσιαδάκη Ελένη (ΑΑ)
created: 2015-09-16
source: Adajian 2012
modified: 2020-04-24
in scheme: HUMANITIES-THESAURUS