HUMANITIES-THESAURUS
type: ConceptScheme

Δραματολόγιο
type: Concept
contributor: Κατσιαδάκη Ελένη (ΑΑ)
contributor: Katsiadakis Helen (AA) @en
created: 2015-10-27
scope note: A repertory is the body of plays staged by a theatre in the course of a season or over a period of time. @en
scope note: Δραματολόγιο είναι το σύνολο των έργων που ανεβάζει ένας θεατρικός οργανισμός σε μια καλλιτεχνική περίοδο ή σε ένα χρονικό διάστημα.
preferred label: Repertoire @de
preferred label: Repertory @en
preferred label: Répertoire @fr
creator: Γουλή Ελένη (ΑΑ)
creator: Goulis Helen (AA) @fr
source: Pavis 2006
in scheme: HUMANITIES-THESAURUS
notation: 596
broader: Πληροφοριακά αντικείμενα
status: Εκδοθείς
alternative label: Ρεπερτόριο
modified: 2019-02-12

Πληροφοριακά αντικείμενα
type: Concept
notation: 240
preferred label: Information objects @en
narrower: Δραματολόγιο