HUMANITIES-THESAURUS
type: ConceptScheme

Λέξη
type: Concept
notation: 161
preferred label: Word @en
narrower: Μόρφημα

Δεσμευμένο μόρφημα
type: Concept
notation: 849
preferred label: Morphème attaché @fr
preferred label: Gebundenes Morphem @de
preferred label: Bound morpheme @en
broader: Μόρφημα

Μόρφημα
type: Concept
source: Carstairs-McCarthy 1992
source: Bloomfield 1933
source: Booij 2007
source: Ράλλη 2005
scope note: Α morpheme is the smallest grammatical and meaningful unit of a language. A morpheme is not identical to a word, and the principal difference between the two is that a morpheme may or may not stand alone, whereas a word, by definition, is freestanding. When it stands by itself, it is considered a root because it has a meaning of its own and when it depends on another morpheme to express an idea, it is an affix because it has a grammatical function. Every word comprises one or more morphemes.The more combinations a morpheme is found in, the more productive it is said to be. @en
scope note: Ο όρος μόρφημα στη μορφολογία και γενικότερα στη γλωσσολογική θεωρία αναφέρεται στο ελάχιστο συστατικό της λέξης που διαθέτει σημασία ή γραμματική λειτουργία. Η μελέτη των μορφημάτων ξεκινά με συστηματικό τρόπο από τον αμερικανικό δομισμό και τον βασικό εκπρόσωπό του, τον Bloomfield (1933).
contributor: Katsiadakis Helen (AA) @en
contributor: Κατσιαδάκη Ελένη (ΑΑ)
modified: 2015-11-02
created: 2015-01-27
preferred label: Morpheme @en
preferred label: Morphème @fr
preferred label: Morphem @de
notation: 586
broader: Λέξη
creator: Καρασίμος Αθανάσιος (ΑΑ)
creator: Karasimos Athanasios (AA) @fr
status: Εκδοθείς
narrower: Δεσμευμένο μόρφημα
narrower: Ελεύθερο μόρφημα
in scheme: HUMANITIES-THESAURUS

Ελεύθερο μόρφημα
type: Concept
notation: 1023
preferred label: Free morpheme @en
preferred label: Freies Morphem @de
preferred label: Morphème libre @fr
broader: Μόρφημα