HUMANITIES-THESAURUS
type: ConceptScheme

Προσδιορισμός σε δοτική πτώση
type: Concept
notation: 776
preferred label: Attribute in the dative case @en
related: Δοτική

Δοτική
type: Concept
modified: 2020-05-27
broader: Πτώσεις (γραμματική)
in scheme: HUMANITIES-THESAURUS
notation: 543
source: Μπαμπινιώτης 2005
scope note: The dative case is a grammatical case used in some languages to indicate, among other uses, the noun to which something is given. Usually the dative marks what would be considered the indirect object of a verb. Sometimes the dative has functions unrelated to giving. In some languages, the term dative case is used in traditional grammars to refer to the prepositional case-marking of nouns following simple prepositions and the definite article. @en
scope note: Η πλάγια πτώση η οποία χρησιμοποιείται για να δηλωθεί κυρίως ο αποδέκτης της ενέργειας, δηλαδή το έμμεσο αντικείμενο του ρήματος. Χρησιμοποιείται επίσης για να εκφράσει διάφορες επιρρηματικές σχέσεις όπως τόπο, χρόνο, αιτία, αναφορά, τρόπο κ.ά.
preferred label: Dative @en
created: 2015-07-02
contributor: Κατσιαδάκη Ελένη (ΑΑ)
contributor: Katsiadakis Helen (AA) @en
related: Προσδιορισμός σε δοτική πτώση
creator: Chatzimichail Christos (AA) @en
creator: Χατζημιχαήλ Χρήστος (ΑΑ)
status: Εκδοθείς

Πτώσεις (γραμματική)
type: Concept
notation: 48
preferred label: Cases (grammar) @en
narrower: Δοτική