HUMANITIES-THESAURUS
type: ConceptScheme

Κλητική
type: Concept
status: Εκδοθείς
creator: Chatzimichail Christos (AA) @fr
creator: Χατζημιχαήλ Χρήστος (ΑΑ)
scope note: Πτώση που χρησιμοποιεί ο ομιλητής όταν καλεί ή προσφωνεί κάποιον. Διαφέρει από τις άλλες πτώσεις στη λειτουργία της και στη γραφή ακολουθείται συνήθως από θαυμαστικό ή τοποθετείται ανάμεσα σε κόμματα.
source: Μπαμπινιώτης 2005
source: Χαραλαμπάκης 2014
notation: 516
preferred label: Vocative @en
modified: 2015-10-04
broader: Πτώσεις (γραμματική)
created: 2015-07-02
contributor: Κατσιαδάκη Ελένη (ΑΑ)
contributor: Katsiadakis Helen (AA) @en
in scheme: HUMANITIES-THESAURUS

Πτώσεις (γραμματική)
type: Concept
notation: 48
preferred label: Cases (grammar) @en
narrower: Κλητική